Reaction Details
TargetCarboxylic ester hydrolase
LigandBDBM50273429
Substrate/Competitorn/a
Meas. Tech.ChEMBL_560896 (CHEMBL1013531)
IC50 7.2±n/a nM
Citation Fang, LAppenroth, DDecker, MKiehntopf, MLupp, APeng, SFleck, CZhang, YLehmann, J NO-donating tacrine hybrid compounds improve scopolamine-induced cognition impairment and show less hepatotoxicity. J Med Chem51:7666-9 (2008) 
 
Carboxylic ester hydrolase
Name:Carboxylic ester hydrolase
Type:Protein
Mol. Mass.:68842.83
Organism:Equus caballus (Horse)
Description:Q9N1N9
Residue:602
BDBM50273429
NameBDBM50273429
Synonyms:9-[N(delta)-propyl -delta-aminobutylamino]-1,2,3,4-tetrahydroacridine | CHEMBL444150
TypeSmall organic molecule
Emp. Form.C20H29N3
Mol. Mass.311.4644
SMILESCCCNCCCCNc1c2CCCCc2nc2ccccc12