Reaction Details
TargetCytochrome P450 2C9
LigandBDBM50273444
Substrate/Competitorn/a
Meas. Tech.ChEMBL_561228 (CHEMBL1012774)
Ki 100±n/a nM
Citation Peng, CCCape, JLRushmore, TCrouch, GJJones, JP Cytochrome P450 2C9 type II binding studies on quinoline-4-carboxamide analogues. J Med Chem51:8000-11 (2008) 
 
Cytochrome P450 2C9
Name:Cytochrome P450 2C9
Type:Enzyme
Mol. Mass.:55636.33
Organism:Homo sapiens (Human)
Description:P11712
Residue:490
BDBM50273444
NameBDBM50273444
Synonyms:CHEMBL463976 | N-Phenyl-2-(pyridin-4-yl)quinoline-4-carboxamide
TypeSmall organic molecule
Emp. Form.C21H15N3O
Mol. Mass.325.3633
SMILESO=C(Nc1ccccc1)c1cc(nc2ccccc12)-c1ccncc1