Reaction Details
TargetCytochrome P450 2C9
LigandBDBM50273790
Substrate/Competitorn/a
Meas. Tech.ChEMBL_561228 (CHEMBL1012774)
Ki 9±n/a nM
Citation Peng, CCCape, JLRushmore, TCrouch, GJJones, JP Cytochrome P450 2C9 type II binding studies on quinoline-4-carboxamide analogues. J Med Chem51:8000-11 (2008) 
 
Cytochrome P450 2C9
Name:Cytochrome P450 2C9
Type:Enzyme
Mol. Mass.:55636.33
Organism:Homo sapiens (Human)
Description:P11712
Residue:490
BDBM50273790
NameBDBM50273790
Synonyms:6-Bromo-N-(naphthalen-2-yl)-2-(pyridin-4-yl)quinoline-4-carboxamide | CHEMBL455975
TypeSmall organic molecule
Emp. Form.C25H16BrN3O
Mol. Mass.454.318
SMILESBrc1ccc2nc(cc(C(=O)Nc3ccc4ccccc4c3)c2c1)-c1ccncc1