Reaction Details
Target11-beta-hydroxysteroid dehydrogenase 1
LigandBDBM50273827
Substrate/Competitorn/a
Meas. Tech.ChEMBL_561232 (CHEMBL1012778)
Ki 79±n/a nM
Citation Fotsch, CBartberger, MDBercot, EAChen, MCupples, REmery, MFretland, JGuram, AHale, CHan, NHickman, DHungate, RWHayashi, MKomorowski, RLiu, QMatsumoto, GSt Jean, DJUrsu, SVéniant, MXu, GYe, QYuan, CZhang, JZhang, XTu, HWang, M Further studies with the 2-amino-1,3-thiazol-4(5H)-one class of 11beta-hydroxysteroid dehydrogenase type 1 inhibitors: reducing pregnane X receptor activity and exploring activity in a monkey pharmacodynamic model. J Med Chem51:7953-67 (2008) 
 
11-beta-hydroxysteroid dehydrogenase 1
Name:11-beta-hydroxysteroid dehydrogenase 1
Type:Enzyme
Mol. Mass.:32409.16
Organism:Homo sapiens (Human)
Description:P28845
Residue:292
BDBM50273827
NameBDBM50273827
Synonyms:2-{(S)-[1-(4-fluorophenyl)ethyl]amino}-5-[4-(2-hydroxyethyl)phenyl]-5-methyl-1,3-thiazol-4(5H)-one | CHEMBL517865
TypeSmall organic molecule
Emp. Form.C20H21FN2O2S
Mol. Mass.372.456
SMILESC[C@H](NC1=NC(=O)C(C)(S1)c1ccc(CCO)cc1)c1ccc(F)cc1