Reaction Details
Target11-beta-hydroxysteroid dehydrogenase 1
LigandBDBM50273450
Substrate/Competitorn/a
Meas. Tech.ChEMBL_561232 (CHEMBL1012778)
Ki 120±n/a nM
Citation Fotsch, CBartberger, MDBercot, EAChen, MCupples, REmery, MFretland, JGuram, AHale, CHan, NHickman, DHungate, RWHayashi, MKomorowski, RLiu, QMatsumoto, GSt Jean, DJUrsu, SVéniant, MXu, GYe, QYuan, CZhang, JZhang, XTu, HWang, M Further studies with the 2-amino-1,3-thiazol-4(5H)-one class of 11beta-hydroxysteroid dehydrogenase type 1 inhibitors: reducing pregnane X receptor activity and exploring activity in a monkey pharmacodynamic model. J Med Chem51:7953-67 (2008) 
 
11-beta-hydroxysteroid dehydrogenase 1
Name:11-beta-hydroxysteroid dehydrogenase 1
Type:Enzyme
Mol. Mass.:32409.16
Organism:Homo sapiens (Human)
Description:P28845
Residue:292
BDBM50273450
NameBDBM50273450
Synonyms:CHEMBL509257 | N-Cyclopentyl-4-{2-[(S)-1-(4-fluorophenyl)ethylamino]-5-methyl-4-oxo-4,5-dihydrothiazol-5-yl}benzamide
TypeSmall organic molecule
Emp. Form.C24H26FN3O2S
Mol. Mass.439.546
SMILESC[C@H](NC1=NC(=O)C(C)(S1)c1ccc(cc1)C(=O)NC1CCCC1)c1ccc(F)cc1