Reaction Details
TargetKappa-type opioid receptor
LigandBDBM50273415
Substrate/Competitorn/a
Meas. Tech.ChEMBL_561950 (CHEMBL1021468)
Ki 620±n/a nM
Citation Kurimura, MLiu, HSulima, AHashimoto, APrzybyl, AKOhshima, EKodato, SDeschamps, JRDersch, CMRothman, RBLee, YSJacobson, AERice, KC Probes for narcotic receptor mediated phenomena. 37. Synthesis and opioid binding affinity of the final pair of oxide-bridged phenylmorphans, the ortho- and para-b-isomers and their N-phenethyl analogues, and the synthesis of the N-phenethyl analogues of the ortho- and para-d-isomers. J Med Chem51:7866-81 (2008) 
 
Kappa-type opioid receptor
Name:Kappa-type opioid receptor
Type:G Protein-Coupled Receptor (GPCR)
Mol. Mass.:42648.76
Organism:Homo sapiens (Human)
Description:P41145
Residue:380
BDBM50273415
NameBDBM50273415
Synonyms:(3R*,6aS*,11aR*)-1,3,4,5,6,11a-Hexahydro-2-methyl-2H-3,6a-methanobenzofuro[2,3-c]azocin-8-ol | CHEMBL509260
TypeSmall organic molecule
Emp. Form.C15H19NO2
Mol. Mass.245.3169
SMILESCN1C[C@@H]2Oc3ccc(O)cc3[C@@]22CCC[C@@H]1C2