Reaction Details
TargetMu-type opioid receptor
LigandBDBM50273464
Substrate/Competitorn/a
Meas. Tech.ChEMBL_561947 (CHEMBL1021465)
Ki 7±n/a nM
Citation Kurimura, MLiu, HSulima, AHashimoto, APrzybyl, AKOhshima, EKodato, SDeschamps, JRDersch, CMRothman, RBLee, YSJacobson, AERice, KC Probes for narcotic receptor mediated phenomena. 37. Synthesis and opioid binding affinity of the final pair of oxide-bridged phenylmorphans, the ortho- and para-b-isomers and their N-phenethyl analogues, and the synthesis of the N-phenethyl analogues of the ortho- and para-d-isomers. J Med Chem51:7866-81 (2008) 
 
Mu-type opioid receptor
Name:Mu-type opioid receptor
Type:G Protein-Coupled Receptor (GPCR)
Mol. Mass.:44789.51
Organism:Homo sapiens (Human)
Description:P35372
Residue:400
BDBM50273464
NameBDBM50273464
Synonyms:(1S,9S,10S)-11-(2-phenylethyl)-8-oxa-11-azatetracyclo[8.3.3.0^{1,9}.0^{2,7}]hexadeca-2(7),3,5-trien-6-ol | CHEMBL514724
TypeSmall organic molecule
Emp. Form.C22H25NO2
Mol. Mass.335.4394
SMILESOc1cccc2c1O[C@@H]1[C@@H]3CCC[C@]21CCN3CCc1ccccc1