Reaction Details
TargetMatrix metalloproteinase-14
LigandBDBM50273424
Substrate/Competitorn/a
Meas. Tech.ChEMBL_561990 (CHEMBL1010053)
IC50 353±n/a nM
Citation Marques, SMNuti, ERossello, ASupuran, CTTuccinardi, TMartinelli, ASantos, MA Dual inhibitors of matrix metalloproteinases and carbonic anhydrases: iminodiacetyl-based hydroxamate-benzenesulfonamide conjugates. J Med Chem51:7968-79 (2008) 
 
Matrix metalloproteinase-14
Name:Matrix metalloproteinase-14
Type:Protein
Mol. Mass.:65900.19
Organism:Homo sapiens (Human)
Description:P50281
Residue:582
BDBM50273424
NameBDBM50273424
Synonyms:CHEMBL450721 | N-(4-Methoxybenzenesulfonyl)-N-hydroxycarbonylmethyl-DvalinehydroxamicAcid
TypeSmall organic molecule
Emp. Form.C14H20N2O7S
Mol. Mass.360.383
SMILESCOc1ccc(cc1)S(=O)(=O)N(CC(O)=O)[C@H](C(C)C)C(=O)NO