Reaction Details
TargetMatrix metalloproteinase-9
LigandBDBM50241252
Substrate/Competitorn/a
Meas. Tech.ChEMBL_561988 (CHEMBL1010051)
IC50 0.510000±n/a nM
Citation Marques, SMNuti, ERossello, ASupuran, CTTuccinardi, TMartinelli, ASantos, MA Dual inhibitors of matrix metalloproteinases and carbonic anhydrases: iminodiacetyl-based hydroxamate-benzenesulfonamide conjugates. J Med Chem51:7968-79 (2008) 
 
Matrix metalloproteinase-9
Name:Matrix metalloproteinase-9
Type:Enzyme
Mol. Mass.:78452.28
Organism:Homo sapiens (Human)
Description:P14780
Residue:707
BDBM50241252
NameBDBM50241252
Synonyms:2-[hydroxycarbamoylmethyl-(4-phenoxy-benzenesulfonyl)-amino]-N-[2-(4-sulfamoyl-phenyl)-ethyl]-acetamide N-(4-Phenoxybenzenesulfonyl)-N-{[2-(4-sulfamoylphenyl)ethylcarbamoyl]methyl}aminoacetohydroxamic Acid
TypeSmall organic molecule
Emp. Form.C24H26N4O8S2
Mol. Mass.562.615
SMILESNS(=O)(=O)c1ccc(CCNC(=O)CN(CC(=O)NO)S(=O)(=O)c2ccc(Oc3ccccc3)cc2)cc1