Reaction Details
TargetMatrix metalloproteinase-16
LigandBDBM50241253
Substrate/Competitorn/a
Meas. Tech.ChEMBL_561991 (CHEMBL1010054)
IC50 186±n/a nM
Citation Marques, SMNuti, ERossello, ASupuran, CTTuccinardi, TMartinelli, ASantos, MA Dual inhibitors of matrix metalloproteinases and carbonic anhydrases: iminodiacetyl-based hydroxamate-benzenesulfonamide conjugates. J Med Chem51:7968-79 (2008) 
 
Matrix metalloproteinase-16
Name:Matrix metalloproteinase-16
Type:PROTEIN
Mol. Mass.:69536.76
Organism:Homo sapiens (Human)
Description:ChEMBL_799129
Residue:607
BDBM50241253
NameBDBM50241253
Synonyms:2-[(biphenyl-4-sulfonyl)-hydroxycarbamoylmethyl-amino]-N-[2-(4-sulfamoyl-phenyl)-ethyl]-acetamide N-(4-Biphenylsulfonyl)-N-{[2-(4-sulfamoylphenyl)ethylcarbamoyl]-methyl}aminoacetohydroxamic Acid
TypeSmall organic molecule
Emp. Form.C24H26N4O7S2
Mol. Mass.546.616
SMILESNS(=O)(=O)c1ccc(CCNC(=O)CN(CC(=O)NO)S(=O)(=O)c2ccc(cc2)-c2ccccc2)cc1