Reaction Details
Target72 kDa type IV collagenase
LigandBDBM50246600
Substrate/Competitorn/a
Meas. Tech.ChEMBL_561986 (CHEMBL1010049)
IC50 193±n/a nM
Citation Marques, SMNuti, ERossello, ASupuran, CTTuccinardi, TMartinelli, ASantos, MA Dual inhibitors of matrix metalloproteinases and carbonic anhydrases: iminodiacetyl-based hydroxamate-benzenesulfonamide conjugates. J Med Chem51:7968-79 (2008) 
 
72 kDa type IV collagenase
Name:72 kDa type IV collagenase
Type:Enzyme
Mol. Mass.:73870.36
Organism:Homo sapiens (Human)
Description: P08253
Residue:660
BDBM50246600
NameBDBM50246600
Synonyms:2-(N-(2-(hydroxyamino)-2-oxoethyl)-4-methoxyphenylsulfonamido)acetic acid | CHEMBL515083
TypeSmall organic molecule
Emp. Form.C11H14N2O7S
Mol. Mass.318.303
SMILESCOc1ccc(cc1)S(=O)(=O)N(CC(O)=O)CC(=O)NO