Reaction Details
TargetCollagenase 3
LigandBDBM50246600
Substrate/Competitorn/a
Meas. Tech.ChEMBL_561989 (CHEMBL1010052)
IC50 213±n/a nM
Citation Marques, SMNuti, ERossello, ASupuran, CTTuccinardi, TMartinelli, ASantos, MA Dual inhibitors of matrix metalloproteinases and carbonic anhydrases: iminodiacetyl-based hydroxamate-benzenesulfonamide conjugates. J Med Chem51:7968-79 (2008) 
 
Collagenase 3
Name:Collagenase 3
Type:Enzyme
Mol. Mass.:53808.06
Organism:Homo sapiens (Human)
Description:P45452
Residue:471
BDBM50246600
NameBDBM50246600
Synonyms:2-(N-(2-(hydroxyamino)-2-oxoethyl)-4-methoxyphenylsulfonamido)acetic acid | CHEMBL515083
TypeSmall organic molecule
Emp. Form.C11H14N2O7S
Mol. Mass.318.303
SMILESCOc1ccc(cc1)S(=O)(=O)N(CC(O)=O)CC(=O)NO