Reaction Details
TargetMatrix metalloproteinase-16
LigandBDBM50246601
Substrate/Competitorn/a
Meas. Tech.ChEMBL_561991 (CHEMBL1010054)
IC50 11±n/a nM
Citation Marques, SMNuti, ERossello, ASupuran, CTTuccinardi, TMartinelli, ASantos, MA Dual inhibitors of matrix metalloproteinases and carbonic anhydrases: iminodiacetyl-based hydroxamate-benzenesulfonamide conjugates. J Med Chem51:7968-79 (2008) 
 
Matrix metalloproteinase-16
Name:Matrix metalloproteinase-16
Type:PROTEIN
Mol. Mass.:69536.76
Organism:Homo sapiens (Human)
Description:ChEMBL_799129
Residue:607
BDBM50246601
NameBDBM50246601
Synonyms:2-(N-(2-(hydroxyamino)-2-oxoethyl)-4-phenoxyphenylsulfonamido)acetic acid | CHEMBL472899
TypeSmall organic molecule
Emp. Form.C16H16N2O7S
Mol. Mass.380.372
SMILESONC(=O)CN(CC(O)=O)S(=O)(=O)c1ccc(Oc2ccccc2)cc1