Reaction Details
TargetCarbonic anhydrase 9
LigandBDBM11635
Substrate/Competitorn/a
Meas. Tech.ChEMBL_561995 (CHEMBL1010058)
Ki 18±n/a nM
Citation Marques, SMNuti, ERossello, ASupuran, CTTuccinardi, TMartinelli, ASantos, MA Dual inhibitors of matrix metalloproteinases and carbonic anhydrases: iminodiacetyl-based hydroxamate-benzenesulfonamide conjugates. J Med Chem51:7968-79 (2008) 
 
Carbonic anhydrase 9
Name:Carbonic anhydrase 9
Type:Enzyme
Mol. Mass.:49669.03
Organism:Homo sapiens (Human)
Description:Catalytic domain of human cloned isozyme was used in the assay
Residue:459
BDBM11635
NameBDBM11635
Synonyms:4-sulfamoyl-N-[2-(4-sulfamoylphenyl)ethyl]benzamide Sulfonamide 2
TypeSmall organic molecule
Emp. Form.C15H17N3O5S2
Mol. Mass.383.443
SMILESNS(=O)(=O)c1ccc(CCNC(=O)c2ccc(cc2)S(N)(=O)=O)cc1