Reaction Details
Target72 kDa type IV collagenase
LigandBDBM50241253
Substrate/Competitorn/a
Meas. Tech.ChEMBL_561986 (CHEMBL1010049)
IC50 16±n/a nM
Citation Marques, SMNuti, ERossello, ASupuran, CTTuccinardi, TMartinelli, ASantos, MA Dual inhibitors of matrix metalloproteinases and carbonic anhydrases: iminodiacetyl-based hydroxamate-benzenesulfonamide conjugates. J Med Chem51:7968-79 (2008) 
 
72 kDa type IV collagenase
Name:72 kDa type IV collagenase
Type:Enzyme
Mol. Mass.:73870.36
Organism:Homo sapiens (Human)
Description: P08253
Residue:660
BDBM50241253
NameBDBM50241253
Synonyms:2-[(biphenyl-4-sulfonyl)-hydroxycarbamoylmethyl-amino]-N-[2-(4-sulfamoyl-phenyl)-ethyl]-acetamide N-(4-Biphenylsulfonyl)-N-{[2-(4-sulfamoylphenyl)ethylcarbamoyl]-methyl}aminoacetohydroxamic Acid
TypeSmall organic molecule
Emp. Form.C24H26N4O7S2
Mol. Mass.546.616
SMILESNS(=O)(=O)c1ccc(CCNC(=O)CN(CC(=O)NO)S(=O)(=O)c2ccc(cc2)-c2ccccc2)cc1