Reaction Details
TargetNeutrophil collagenase
LigandBDBM50241249
Substrate/Competitorn/a
Meas. Tech.ChEMBL_561987 (CHEMBL1010050)
IC50 4360±n/a nM
Citation Marques, SMNuti, ERossello, ASupuran, CTTuccinardi, TMartinelli, ASantos, MA Dual inhibitors of matrix metalloproteinases and carbonic anhydrases: iminodiacetyl-based hydroxamate-benzenesulfonamide conjugates. J Med Chem51:7968-79 (2008) 
 
Neutrophil collagenase
Name:Neutrophil collagenase
Type:Enzyme
Mol. Mass.:53413.48
Organism:Homo sapiens (Human)
Description:P22894
Residue:467
BDBM50241249
NameBDBM50241249
Synonyms:((4-phenoxy-benzenesulfonyl)-{[2-(4sulfamoyl-phenyl)-ethylcarbamoyl]-methyl}-amino)-acetic acid N-(4-Phenoxybenzenesulfonyl)-N-{[2-(4-sulfamoylphenyl)ethylcarbamoyl]methyl}aminoacetic Acid
TypeSmall organic molecule
Emp. Form.C24H25N3O8S2
Mol. Mass.547.601
SMILESNS(=O)(=O)c1ccc(CCNC(=O)CN(CC(O)=O)S(=O)(=O)c2ccc(Oc3ccccc3)cc2)cc1