Reaction Details
TargetNeutrophil collagenase
LigandBDBM50241251
Substrate/Competitorn/a
Meas. Tech.ChEMBL_561987 (CHEMBL1010050)
IC50 59±n/a nM
Citation Marques, SMNuti, ERossello, ASupuran, CTTuccinardi, TMartinelli, ASantos, MA Dual inhibitors of matrix metalloproteinases and carbonic anhydrases: iminodiacetyl-based hydroxamate-benzenesulfonamide conjugates. J Med Chem51:7968-79 (2008) 
 
Neutrophil collagenase
Name:Neutrophil collagenase
Type:Enzyme
Mol. Mass.:53413.48
Organism:Homo sapiens (Human)
Description:P22894
Residue:467
BDBM50241251
NameBDBM50241251
Synonyms:2-[hydroxycarbamoylmethyl-(4-methoxy-benzenesulfonyl)-amino]-N-[2-(4-sulfamoyl-phenyl)-ethyl]-acetamide N-(4-Methoxybenzenesulfonyl)-N-{[2-(4-sulfamoylphenyl)ethylcarbamoyl]methyl}aminoacetohydroxamic Acid
TypeSmall organic molecule
Emp. Form.C19H24N4O8S2
Mol. Mass.500.546
SMILESCOc1ccc(cc1)S(=O)(=O)N(CC(=O)NO)CC(=O)NCCc1ccc(cc1)S(N)(=O)=O