Reaction Details
TargetProtein ADM2
LigandBDBM50000743
Substrate/Competitorn/a
Meas. Tech.ChEMBL_556927 (CHEMBL954953)
IC50 266±n/a nM
Citation Miranda, LPHolder, JRShi, LBennett, BAral, JGegg, CVWright, MWalker, KDoellgast, GRogers, RLi, HValladares, VSalyers, KJohnson, EWild, K Identification of potent, selective, and metabolically stable peptide antagonists to the calcitonin gene-related peptide (CGRP) receptor. J Med Chem51:7889-97 (2008) 
 
Protein ADM2
Name:Protein ADM2
Type:PROTEIN
Mol. Mass.:15883.28
Organism:Homo sapiens (Human)
Description:ChEMBL_556927
Residue:148
BDBM50000743
NameBDBM50000743
Synonyms:CHEMBL525571 h alpha-CGRP8-37
TypeSmall organic molecule
Emp. Form.C139H230N44O38
Mol. Mass.3125.5855
SMILESCC(C)C[C@H](NC(=O)CNC(=O)[C@H](C)NC(=O)[C@H](CC(C)C)NC(=O)[C@H](CCCNC(N)=N)NC(=O)[C@H](Cc1cnc[nH]1)NC(=O)[C@@H](NC(=O)[C@@H](N)C(C)C)[C@@H](C)O)C(=O)N[C@@H](CC(C)C)C(=O)N[C@@H](CO)C(=O)N[C@@H](CCCNC(N)=N)C(=O)N[C@@H](CO)C(=O)NCC(=O)NCC(=O)N[C@@H](C(C)C)C(=O)N[C@@H](C(C)C)C(=O)N[C@@H](CCCCN)C(=O)N[C@@H](CC(N)=O)C(=O)N[C@@H](CC(N)=O)C(=O)N[C@@H](Cc1ccccc1)C(=O)N[C@@H](C(C)C)C(=O)N1CCC[C@H]1C(=O)N[C@@H]([C@@H](C)O)C(=O)N[C@@H](CC(N)=O)C(=O)N[C@@H](C(C)C)C(=O)NCC(=O)N[C@@H](CO)C(=O)N[C@@H](CCCCN)C(=O)N[C@@H](C)C(=O)N[C@@H](Cc1ccccc1)C(N)=O