Reaction Details
TargetC-X-C chemokine receptor type 4
LigandBDBM50246956
Substrate/Competitorn/a
Meas. Tech.ChEMBL_556954 (CHEMBL958140)
IC50 55±n/a nM
Citation Thoma, GStreiff, MBKovarik, JGlickman, FWagner, TBeerli, CZerwes, HG Orally bioavailable isothioureas block function of the chemokine receptor CXCR4 in vitro and in vivo. J Med Chem51:7915-20 (2008) 
 
C-X-C chemokine receptor type 4
Name:C-X-C chemokine receptor type 4
Type:Enzyme
Mol. Mass.:39342.13
Organism:Rattus norvegicus (Rat)
Description:O08565
Residue:349
BDBM50246956
NameBDBM50246956
Synonyms:1,3-dicyclohexyl-2-((5,6-dihydroimidazo[2,1-b]thiazol-3-yl)methyl)isothiourea | CHEMBL452864
TypeSmall organic molecule
Emp. Form.C19H30N4S2
Mol. Mass.378.598
SMILESC(S\C(NC1CCCCC1)=N/C1CCCCC1)C1=CSC2=NCCN12