Reaction Details
TargetProto-oncogene tyrosine-protein kinase receptor Ret
LigandBDBM50246571
Substrate/Competitorn/a
Meas. Tech.ChEMBL_556993 (CHEMBL958179)
IC50 110±n/a nM
Citation Cincinelli, RCassinelli, GDallavalle, SLanzi, CMerlini, LBotta, MTuccinardi, TMartinelli, APenco, SZunino, F Synthesis, modeling, and RET protein kinase inhibitory activity of 3- and 4-substituted beta-carbolin-1-ones. J Med Chem51:7777-87 (2008) 
 
Proto-oncogene tyrosine-protein kinase receptor Ret
Name:Proto-oncogene tyrosine-protein kinase receptor Ret
Type:Protein
Mol. Mass.:124318.29
Organism:Homo sapiens (Human)
Description:P07949
Residue:1114
BDBM50246571
NameBDBM50246571
Synonyms:4-(4-hydroxyphenyl)-6,7-dimethoxy-2H-pyrido[3,4-b]indol-1(9H)-one | CHEMBL461162
TypeSmall organic molecule
Emp. Form.C19H16N2O4
Mol. Mass.336.3413
SMILESCOc1cc2[nH]c3c(c(c[nH]c3=O)-c3ccc(O)cc3)c2cc1OC