Reaction Details
TargetSodium-dependent serotonin transporter
LigandBDBM50247065
Substrate/Competitorn/a
Meas. Tech.ChEMBL_561312 (CHEMBL1017073)
Ki 0.26±n/a nM
Citation Stehouwer, JSJarkas, NZeng, FVoll, RJWilliams, LCamp, VMMalveaux, EJVotaw, JRHowell, LOwens, MJGoodman, MM Synthesis, radiosynthesis, and biological evaluation of fluorine-18-labeled 2beta-carbo(fluoroalkoxy)-3beta-(3'-((Z)-2-haloethenyl)phenyl)nortropanes: candidate radioligands for in vivo imaging of the serotonin transporter with positron emission tomography. J Med Chem51:7788-99 (2008) 
 
Sodium-dependent serotonin transporter
Name:Sodium-dependent serotonin transporter
Type:Multi-pass membrane protein
Mol. Mass.:70322.51
Organism:Homo sapiens (Human)
Description:P31645
Residue:630
BDBM50247065
NameBDBM50247065
Synonyms:2beta-Carbo(2-fluoropropoxy)-3beta-(3'-((Z)-2-iodoethenyl)phenyl)-nortropane | CHEMBL462410
TypeSmall organic molecule
Emp. Form.C19H23FINO2
Mol. Mass.443.2943
SMILESFCCCOC(=O)C1C2CCC(CC1c1cccc(\C=C/I)c1)N2