Reaction Details
TargetSodium-dependent serotonin transporter
LigandBDBM50247066
Substrate/Competitorn/a
Meas. Tech.ChEMBL_561312 (CHEMBL1017073)
Ki 0.33±n/a nM
Citation Stehouwer, JSJarkas, NZeng, FVoll, RJWilliams, LCamp, VMMalveaux, EJVotaw, JRHowell, LOwens, MJGoodman, MM Synthesis, radiosynthesis, and biological evaluation of fluorine-18-labeled 2beta-carbo(fluoroalkoxy)-3beta-(3'-((Z)-2-haloethenyl)phenyl)nortropanes: candidate radioligands for in vivo imaging of the serotonin transporter with positron emission tomography. J Med Chem51:7788-99 (2008) 
 
Sodium-dependent serotonin transporter
Name:Sodium-dependent serotonin transporter
Type:Multi-pass membrane protein
Mol. Mass.:70322.51
Organism:Homo sapiens (Human)
Description:P31645
Residue:630
BDBM50247066
NameBDBM50247066
Synonyms:2beta-Carbo(2-fluoropropoxy)-3beta-(3'-((Z)-2-bmoroethenyl)phenyl)-nortropane | CHEMBL462585
TypeSmall organic molecule
Emp. Form.C19H23BrFNO2
Mol. Mass.396.294
SMILESFCCCOC(=O)C1C2CCC(CC1c1cccc(\C=C/Br)c1)N2