Reaction Details
TargetNeuropeptide Y receptor type 1
LigandBDBM50246649
Substrate/Competitorn/a
Meas. Tech.ChEMBL_562264 (CHEMBL1011807)
Ki 0.1±n/a nM
Citation Keller, MPop, NHutzler, CBeck-Sickinger, AGBernhardt, GBuschauer, A Guanidine-acylguanidine bioisosteric approach in the design of radioligands: synthesis of a tritium-labeled N(G)-propionylargininamide ([3H]-UR-MK114) as a highly potent and selective neuropeptide Y Y1 receptor antagonist. J Med Chem51:8168-72 (2008) 
 
Neuropeptide Y receptor type 1
Name:Neuropeptide Y receptor type 1
Type:Enzyme Catalytic Domain
Mol. Mass.:44399.07
Organism:Homo sapiens (Human)
Description:NPY-Y1 NPY1R HUMAN::P25929
Residue:384
BDBM50246649
NameBDBM50246649
Synonyms:(R)-ethyl 2-(3-((5-(4-hydroxybenzylamino)-4-(2,2-diphenylacetamido)-5-oxopentylamino)(amino)methylene)ureido)acetate | CHEMBL508974
TypeSmall organic molecule
Emp. Form.C32H38N6O6
Mol. Mass.602.6807
SMILESCCOC(=O)CNC(=O)NC(N)=NCCC[C@@H](NC(=O)C(c1ccccc1)c1ccccc1)C(=O)NCc1ccc(O)cc1