Reaction Details
TargetGlutamate carboxypeptidase 2
LigandBDBM50246899
Substrate/Competitorn/a
Meas. Tech.ChEMBL_557374 (CHEMBL955704)
Ki 0.01±n/a nM
Citation Chen, YFoss, CAByun, YNimmagadda, SPullambhatla, MFox, JJCastanares, MLupold, SEBabich, JWMease, RCPomper, MG Radiohalogenated prostate-specific membrane antigen (PSMA)-based ureas as imaging agents for prostate cancer. J Med Chem51:7933-43 (2008) 
 
Glutamate carboxypeptidase 2
Name:Glutamate carboxypeptidase 2
Type:PROTEIN
Mol. Mass.:84333.66
Organism:Homo sapiens (Human)
Description:ChEMBL_1497035
Residue:750
BDBM50246899
NameBDBM50246899
Synonyms:(S)-2-(3-((S)-1-carboxy-5-(4-iodobenzamido)pentyl)ureido)pentanedioic acid N-{[(1S)-1-carboxy-5-{[(4-iodophenyl)carbonyl]amino}pentyl]carbamoyl}-L-glutamic acid
TypeSmall organic molecule
Emp. Form.C19H24IN3O8
Mol. Mass.549.3136
SMILESOC(=O)CC[C@H](NC(=O)N[C@@H](CCCCNC(=O)c1ccc(I)cc1)C(O)=O)C(O)=O