Reaction Details
TargetEphrin type-B receptor 4
LigandBDBM50246776
Substrate/Competitorn/a
Meas. Tech.ChEMBL_557466 (CHEMBL962244)
IC50 3900±n/a nM
Citation Danilenko, VNSimonov, AYLakatosh, SAKubbutat, MHTotzke, FSchächtele, CElizarov, SMBekker, OBPrintsevskaya, SSLuzikov, YNReznikova, MIShtil, AAPreobrazhenskaya, MN Search for inhibitors of bacterial and human protein kinases among derivatives of diazepines[1,4] annelated with maleimide and indole cycles. J Med Chem51:7731-6 (2008) 
 
Ephrin type-B receptor 4
Name:Ephrin type-B receptor 4
Type:Enzyme
Mol. Mass.:108273.51
Organism:Homo sapiens (Human)
Description:P54760
Residue:987
BDBM50246776
NameBDBM50246776
Synonyms:3-(1,3-Dioxo-1,3-dihydro-2H-indolo[1',7':4,5,6]pyrrolo[3',4':2,3][1,4]diazepino[1,7-a]indol-2-yl)propyl N-Methylimidothiocarbamate | CHEMBL488271
TypeSmall organic molecule
Emp. Form.C25H21N5O2S
Mol. Mass.455.532
SMILESCN=C(N)SCCCn1c(=O)c2c(n3c(cc4ccccc34)c3cccc4ccn2c34)c1=O