Reaction Details
TargetPolyphenol oxidase 2
LigandBDBM26189
Substrate/Competitorn/a
Meas. Tech.ChEMBL_559529 (CHEMBL1019002)
IC50 1440000±n/a nM
Citation Tocco, GFais, AMeli, GBegala, MPodda, GFadda, MBCorda, MAttanasi, OAFilippone, PBerretta, S PEG-immobilization of cardol and soluble polymer-supported synthesis of some cardol-coumarin derivatives: preliminary evaluation of their inhibitory activity on mushroom tyrosinase. Bioorg Med Chem Lett19:36-9 (2008) 
 
Polyphenol oxidase 2
Name:Polyphenol oxidase 2
Type:Protein
Mol. Mass.:63923.66
Organism:Agaricus bisporus (Common mushroom)
Description:O42713
Residue:556
BDBM26189
NameBDBM26189
Synonyms:α-CA inhibitor, 13 1,3-dihydroxybenzene US9688816, 4 phenol derivative, 3
TypeSmall organic molecule
Emp. Form.C6H6O2
Mol. Mass.110.1106
SMILESOc1cccc(O)c1