Reaction Details
TargetRetinoic acid receptor alpha
LigandBDBM50265920
Substrate/Competitorn/a
Meas. Tech.ChEMBL_544804 (CHEMBL1011984)
EC50 0.6±n/a nM
Citation Charton, JDeprez-Poulain, RHennuyer, NTailleux, AStaels, BDeprez, B Novel non-carboxylic acid retinoids: 1,2,4-oxadiazol-5-one derivatives. Bioorg Med Chem Lett19:489-92 (2008) 
 
Retinoic acid receptor alpha
Name:Retinoic acid receptor alpha
Type:PROTEIN
Mol. Mass.:50778.87
Organism:Homo sapiens (Human)
Description:ChEMBL_1466191
Residue:462
BDBM50265920
NameBDBM50265920
Synonyms:4-((5,5,8,8-tetramethyl-5,6,7,8-tetrahydronaphthalen-2-yl)ethynyl)benzoic acid US9963439, BE23
TypeSmall organic molecule
Emp. Form.C23H24O2
Mol. Mass.332.4355
SMILESCC1(C)CCC(C)(C)c2cc(ccc12)C#Cc1ccc(cc1)C(O)=O