Reaction Details
TargetRetinoic acid receptor beta
LigandBDBM50265951
Substrate/Competitorn/a
Meas. Tech.ChEMBL_544806 (CHEMBL1011986)
EC50 0.8±n/a nM
Citation Charton, JDeprez-Poulain, RHennuyer, NTailleux, AStaels, BDeprez, B Novel non-carboxylic acid retinoids: 1,2,4-oxadiazol-5-one derivatives. Bioorg Med Chem Lett19:489-92 (2008) 
 
Retinoic acid receptor beta
Name:Retinoic acid receptor beta
Type:PROTEIN
Mol. Mass.:50498.70
Organism:Homo sapiens (Human)
Description:ChEMBL_1458015
Residue:455
BDBM50265951
NameBDBM50265951
Synonyms:CHEMBL1657 US9963439, Tazarotene | ethyl 6-[(4,4-dimethyl-3,4-dihydro-2H-thiochromen-6-yl)ethynyl]nicotinate
TypeSmall organic molecule
Emp. Form.C21H21NO2S
Mol. Mass.351.462
SMILESCCOC(=O)c1ccc(nc1)C#Cc1ccc2SCCC(C)(C)c2c1