Reaction Details
TargetEndothelial lipase
LigandBDBM50254340
Substrate/Competitorn/a
Meas. Tech.ChEMBL_559992 (CHEMBL1018742)
IC50 200±n/a nM
Citation Goodman, KBBury, MJCheung, MCichy-Knight, MADowdell, SEDunn, AKLee, DLieby, JAMoore, MLScherzer, DASha, DSuarez, DPMurphy, DJHarpel, MRManas, ESMcNulty, DEAnnan, RSMatico, RESchwartz, BKTrill, JJSweitzer, TDWang, DYKeller, PMKrawiec, JAJaye, MC Discovery of potent, selective sulfonylfuran urea endothelial lipase inhibitors. Bioorg Med Chem Lett19:27-30 (2008) 
 
Endothelial lipase
Name:Endothelial lipase
Type:Protein
Mol. Mass.:56805.62
Organism:Homo sapiens (Human)
Description:Q9Y5X9
Residue:500
BDBM50254340
NameBDBM50254340
Synonyms:1-(4-chlorophenyl)-3-(2-methyl-5-(piperidin-1-ylsulfonyl)furan-3-yl)urea | CHEMBL505390
TypeSmall organic molecule
Emp. Form.C17H20ClN3O4S
Mol. Mass.397.876
SMILESCc1oc(cc1NC(=O)Nc1ccc(Cl)cc1)S(=O)(=O)N1CCCCC1