Reaction Details
TargetLipoprotein lipase
LigandBDBM50254043
Substrate/Competitorn/a
Meas. Tech.ChEMBL_559993 (CHEMBL1018743)
IC50>50000±n/a nM
Citation Goodman, KBBury, MJCheung, MCichy-Knight, MADowdell, SEDunn, AKLee, DLieby, JAMoore, MLScherzer, DASha, DSuarez, DPMurphy, DJHarpel, MRManas, ESMcNulty, DEAnnan, RSMatico, RESchwartz, BKTrill, JJSweitzer, TDWang, DYKeller, PMKrawiec, JAJaye, MC Discovery of potent, selective sulfonylfuran urea endothelial lipase inhibitors. Bioorg Med Chem Lett19:27-30 (2008) 
 
Lipoprotein lipase
Name:Lipoprotein lipase
Type:PROTEIN
Mol. Mass.:53093.31
Organism:Rattus norvegicus
Description:ChEMBL_559993
Residue:474
BDBM50254043
NameBDBM50254043
Synonyms:1-(2-methyl-6-(piperidin-1-ylsulfonyl)pyridin-3-yl)-3-phenylurea | CHEMBL461187
TypeSmall organic molecule
Emp. Form.C18H22N4O3S
Mol. Mass.374.457
SMILESCc1nc(ccc1NC(=O)Nc1ccccc1)S(=O)(=O)N1CCCCC1