Reaction Details
TargetLipoprotein lipase
LigandBDBM50254433
Substrate/Competitorn/a
Meas. Tech.ChEMBL_559993 (CHEMBL1018743)
IC50 500±n/a nM
Citation Goodman, KBBury, MJCheung, MCichy-Knight, MADowdell, SEDunn, AKLee, DLieby, JAMoore, MLScherzer, DASha, DSuarez, DPMurphy, DJHarpel, MRManas, ESMcNulty, DEAnnan, RSMatico, RESchwartz, BKTrill, JJSweitzer, TDWang, DYKeller, PMKrawiec, JAJaye, MC Discovery of potent, selective sulfonylfuran urea endothelial lipase inhibitors. Bioorg Med Chem Lett19:27-30 (2008) 
 
Lipoprotein lipase
Name:Lipoprotein lipase
Type:PROTEIN
Mol. Mass.:53093.31
Organism:Rattus norvegicus
Description:ChEMBL_559993
Residue:474
BDBM50254433
NameBDBM50254433
Synonyms:1-(2-methyl-5-(4-methylpiperazin-1-ylsulfonyl)furan-3-yl)-3-phenylurea | CHEMBL469114
TypeSmall organic molecule
Emp. Form.C17H22N4O4S
Mol. Mass.378.446
SMILESCN1CCN(CC1)S(=O)(=O)c1cc(NC(=O)Nc2ccccc2)c(C)o1