Reaction Details
TargetLipoprotein lipase
LigandBDBM50254432
Substrate/Competitorn/a
Meas. Tech.ChEMBL_559993 (CHEMBL1018743)
IC50 40±n/a nM
Citation Goodman, KBBury, MJCheung, MCichy-Knight, MADowdell, SEDunn, AKLee, DLieby, JAMoore, MLScherzer, DASha, DSuarez, DPMurphy, DJHarpel, MRManas, ESMcNulty, DEAnnan, RSMatico, RESchwartz, BKTrill, JJSweitzer, TDWang, DYKeller, PMKrawiec, JAJaye, MC Discovery of potent, selective sulfonylfuran urea endothelial lipase inhibitors. Bioorg Med Chem Lett19:27-30 (2008) 
 
Lipoprotein lipase
Name:Lipoprotein lipase
Type:PROTEIN
Mol. Mass.:53093.31
Organism:Rattus norvegicus
Description:ChEMBL_559993
Residue:474
BDBM50254432
NameBDBM50254432
Synonyms:1-(2-methyl-5-(morpholinosulfonyl)furan-3-yl)-3-phenylurea | CHEMBL513697
TypeSmall organic molecule
Emp. Form.C16H19N3O5S
Mol. Mass.365.404
SMILESCc1oc(cc1NC(=O)Nc1ccccc1)S(=O)(=O)N1CCOCC1