Reaction Details
TargetLipoprotein lipase
LigandBDBM50254343
Substrate/Competitorn/a
Meas. Tech.ChEMBL_559993 (CHEMBL1018743)
IC50 400±n/a nM
Citation Goodman, KBBury, MJCheung, MCichy-Knight, MADowdell, SEDunn, AKLee, DLieby, JAMoore, MLScherzer, DASha, DSuarez, DPMurphy, DJHarpel, MRManas, ESMcNulty, DEAnnan, RSMatico, RESchwartz, BKTrill, JJSweitzer, TDWang, DYKeller, PMKrawiec, JAJaye, MC Discovery of potent, selective sulfonylfuran urea endothelial lipase inhibitors. Bioorg Med Chem Lett19:27-30 (2008) 
 
Lipoprotein lipase
Name:Lipoprotein lipase
Type:PROTEIN
Mol. Mass.:53093.31
Organism:Rattus norvegicus
Description:ChEMBL_559993
Residue:474
BDBM50254343
NameBDBM50254343
Synonyms:(S)-1-(2-methyl-5-(piperidin-1-ylsulfonyl)furan-3-yl)-3-(1-phenylethyl)urea | CHEMBL467023
TypeSmall organic molecule
Emp. Form.C19H25N3O4S
Mol. Mass.391.484
SMILESC[C@H](NC(=O)Nc1cc(oc1C)S(=O)(=O)N1CCCCC1)c1ccccc1