Reaction Details
TargetEndothelial lipase
LigandBDBM50253973
Substrate/Competitorn/a
Meas. Tech.ChEMBL_559992 (CHEMBL1018742)
IC50>50000±n/a nM
Citation Goodman, KBBury, MJCheung, MCichy-Knight, MADowdell, SEDunn, AKLee, DLieby, JAMoore, MLScherzer, DASha, DSuarez, DPMurphy, DJHarpel, MRManas, ESMcNulty, DEAnnan, RSMatico, RESchwartz, BKTrill, JJSweitzer, TDWang, DYKeller, PMKrawiec, JAJaye, MC Discovery of potent, selective sulfonylfuran urea endothelial lipase inhibitors. Bioorg Med Chem Lett19:27-30 (2008) 
 
Endothelial lipase
Name:Endothelial lipase
Type:Protein
Mol. Mass.:56805.62
Organism:Homo sapiens (Human)
Description:Q9Y5X9
Residue:500
BDBM50253973
NameBDBM50253973
Synonyms:1-(2,4-dimethyl-5-(piperidin-1-ylsulfonyl)furan-3-yl)-3-phenylurea | CHEMBL460141
TypeSmall organic molecule
Emp. Form.C18H23N3O4S
Mol. Mass.377.458
SMILESCc1oc(c(C)c1NC(=O)Nc1ccccc1)S(=O)(=O)N1CCCCC1