Reaction Details
TargetEndothelial lipase
LigandBDBM50254397
Substrate/Competitorn/a
Meas. Tech.ChEMBL_559992 (CHEMBL1018742)
IC50>50000±n/a nM
Citation Goodman, KBBury, MJCheung, MCichy-Knight, MADowdell, SEDunn, AKLee, DLieby, JAMoore, MLScherzer, DASha, DSuarez, DPMurphy, DJHarpel, MRManas, ESMcNulty, DEAnnan, RSMatico, RESchwartz, BKTrill, JJSweitzer, TDWang, DYKeller, PMKrawiec, JAJaye, MC Discovery of potent, selective sulfonylfuran urea endothelial lipase inhibitors. Bioorg Med Chem Lett19:27-30 (2008) 
 
Endothelial lipase
Name:Endothelial lipase
Type:Protein
Mol. Mass.:56805.62
Organism:Homo sapiens (Human)
Description:Q9Y5X9
Residue:500
BDBM50254397
NameBDBM50254397
Synonyms:2-methyl-N-phenyl-5-(piperidin-1-ylsulfonyl)furan-3-carboxamide | CHEMBL468911
TypeSmall organic molecule
Emp. Form.C17H20N2O4S
Mol. Mass.348.417
SMILESCc1oc(cc1C(=O)Nc1ccccc1)S(=O)(=O)N1CCCCC1