Reaction Details
TargetAdenosine receptor A2a
LigandBDBM50265981
Substrate/Competitorn/a
Meas. Tech.ChEMBL_540180 (CHEMBL1029809)
Ki 67±n/a nM
Citation Cole, AGStauffer, TMRokosz, LLMetzger, ADillard, LWZeng, WHenderson, I Synthesis of 2-amino-5-benzoyl-4-(2-furyl)thiazoles as adenosine A(2A) receptor antagonists. Bioorg Med Chem Lett19:378-81 (2008) 
 
Adenosine receptor A2a
Name:Adenosine receptor A2a
Type:G Protein-Coupled Receptor (GPCR)
Mol. Mass.:44716.46
Organism:Homo sapiens (Human)
Description:P29274
Residue:412
BDBM50265981
NameBDBM50265981
Synonyms:(4-(furan-2-yl)-2-(methylamino)thiazol-5-yl)(phenyl)methanone | CHEMBL461665
TypeSmall organic molecule
Emp. Form.C15H12N2O2S
Mol. Mass.284.333
SMILESCNc1nc(-c2ccco2)c(s1)C(=O)c1ccccc1