Reaction Details
TargetArylamine N-acetyltransferase 1
LigandBDBM50275074
Substrate/Competitorn/a
Meas. Tech.ChEMBL_494095 (CHEMBL942267)
IC50 330±n/a nM
Citation Russell, AJWestwood, IMCrawford, MHRobinson, JKawamura, ARedfield, CLaurieri, NLowe, EDDavies, SGSim, E Selective small molecule inhibitors of the potential breast cancer marker, human arylamine N-acetyltransferase 1, and its murine homologue, mouse arylamine N-acetyltransferase 2. Bioorg Med Chem17:905-18 (2009) 
 
Arylamine N-acetyltransferase 1
Name:Arylamine N-acetyltransferase 1
Type:PROTEIN
Mol. Mass.:33898.32
Organism:Homo sapiens (Human)
Description:ChEMBL_1347886
Residue:290
BDBM50275074
NameBDBM50275074
Synonyms:(Z)-5-(3',5'-Diiodo-4'-hydroxybenzylidene)-2-thioxothiazolidine-4-one | CHEMBL458614
TypeSmall organic molecule
Emp. Form.C10H5I2NO2S2
Mol. Mass.489.091
SMILESOc1c(I)cc(C=C2SC(S)=NC2=O)cc1I