Reaction Details
TargetMu-type opioid receptor
LigandBDBM50266057
Substrate/Competitorn/a
Meas. Tech.ChEMBL_540202 (CHEMBL1029831)
Ki 64.9±n/a nM
Citation Ballet, SFeytens, DWachter, RDVlaeminck, MDMarczak, EDSalvadori, SGraaf, CRognan, DNegri, LLattanzi, RLazarus, LHTourwé, DBalboni, G Conformationally constrained opioid ligands: the Dmt-Aba and Dmt-Aia versus Dmt-Tic scaffold. Bioorg Med Chem Lett19:433-7 (2008) 
 
Mu-type opioid receptor
Name:Mu-type opioid receptor
Type:G Protein-Coupled Receptor (GPCR)
Mol. Mass.:44503.11
Organism:Rattus norvegicus (rat)
Description:Competition binding assays were carried out using membrane preparations from transfected HN9.10 cells that constitutively expressed the mu opioid receptor.
Residue:398
BDBM50266057
NameBDBM50266057
Synonyms:(S)-2-(dimethylamino)-3-(4-hydroxy-2,6-dimethylphenyl)-N-((S)-3-oxo-2,3,4,5-tetrahydro-1H-benzo[c]azepin-4-yl)propanamide | CHEMBL459281
TypeSmall organic molecule
Emp. Form.C23H29N3O3
Mol. Mass.395.4947
SMILESCN(C)[C@@H](Cc1c(C)cc(O)cc1C)C(=O)N[C@H]1Cc2ccccc2CNC1=O