Reaction Details
TargetMu-type opioid receptor
LigandBDBM50266060
Substrate/Competitorn/a
Meas. Tech.ChEMBL_540202 (CHEMBL1029831)
Ki 3.35±n/a nM
Citation Ballet, SFeytens, DWachter, RDVlaeminck, MDMarczak, EDSalvadori, SGraaf, CRognan, DNegri, LLattanzi, RLazarus, LHTourwé, DBalboni, G Conformationally constrained opioid ligands: the Dmt-Aba and Dmt-Aia versus Dmt-Tic scaffold. Bioorg Med Chem Lett19:433-7 (2008) 
 
Mu-type opioid receptor
Name:Mu-type opioid receptor
Type:G Protein-Coupled Receptor (GPCR)
Mol. Mass.:44503.11
Organism:Rattus norvegicus (rat)
Description:Competition binding assays were carried out using membrane preparations from transfected HN9.10 cells that constitutively expressed the mu opioid receptor.
Residue:398
BDBM50266060
NameBDBM50266060
Synonyms:(S)-2-amino-N-((R)-2-(2-(benzylamino)-2-oxoethyl)-3-oxo-1,2,3,4,5,10-hexahydroazepino[3,4-b]indol-4-yl)-3-(4-hydroxy-2,6-dimethylphenyl)propanamide | CHEMBL506761
TypeSmall organic molecule
Emp. Form.C32H35N5O4
Mol. Mass.553.6514
SMILESCc1cc(O)cc(C)c1C[C@H](N)C(=O)N[C@@H]1Cc2c(CN(CC(=O)NCc3ccccc3)C1=O)[nH]c1ccccc21