Reaction Details
TargetCannabinoid receptor 2
LigandBDBM50254163
Substrate/Competitorn/a
Meas. Tech.ChEMBL_560036 (CHEMBL1021556)
EC50 189±n/a nM
Citation Marx, IEDiMauro, EFCheng, AEmkey, RHitchcock, SAHuang, LHuang, MYHuman, JLee, JHLi, XMartin, MWWhite, RDFremeau, RTPatel, VF Discovery of alpha-amidosulfones as potent and selective agonists of CB2: synthesis, SAR, and pharmacokinetic properties. Bioorg Med Chem Lett19:31-5 (2008) 
 
Cannabinoid receptor 2
Name:Cannabinoid receptor 2
Type:G Protein-Coupled Receptor (GPCR)
Mol. Mass.:39690.94
Organism:Homo sapiens (Human)
Description:P34972
Residue:360
BDBM50254163
NameBDBM50254163
Synonyms:2-(4-chlorophenylsulfonyl)-2-methyl-N-(5-o-tolyl-1,3,4-thiadiazol-2-yl)propanamide | CHEMBL461223
TypeSmall organic molecule
Emp. Form.C19H18ClN3O3S2
Mol. Mass.435.948
SMILESCc1ccccc1-c1nnc(NC(=O)C(C)(C)S(=O)(=O)c2ccc(Cl)cc2)s1