Reaction Details
TargetCannabinoid receptor 2
LigandBDBM50254129
Substrate/Competitorn/a
Meas. Tech.ChEMBL_560036 (CHEMBL1021556)
EC50 1300±n/a nM
Citation Marx, IEDiMauro, EFCheng, AEmkey, RHitchcock, SAHuang, LHuang, MYHuman, JLee, JHLi, XMartin, MWWhite, RDFremeau, RTPatel, VF Discovery of alpha-amidosulfones as potent and selective agonists of CB2: synthesis, SAR, and pharmacokinetic properties. Bioorg Med Chem Lett19:31-5 (2008) 
 
Cannabinoid receptor 2
Name:Cannabinoid receptor 2
Type:G Protein-Coupled Receptor (GPCR)
Mol. Mass.:39690.94
Organism:Homo sapiens (Human)
Description:P34972
Residue:360
BDBM50254129
NameBDBM50254129
Synonyms:CHEMBL467240 | N-(3-chloro-4-fluorobenzyl)-2-(4-chlorophenylsulfonyl)-2-methylpropanamide
TypeSmall organic molecule
Emp. Form.C17H16Cl2FNO3S
Mol. Mass.404.283
SMILESCC(C)(C(=O)NCc1ccc(F)c(Cl)c1)S(=O)(=O)c1ccc(Cl)cc1