Reaction Details
TargetCannabinoid receptor 2
LigandBDBM50254143
Substrate/Competitorn/a
Meas. Tech.ChEMBL_560040 (CHEMBL1021560)
EC50 5±n/a nM
Citation Marx, IEDiMauro, EFCheng, AEmkey, RHitchcock, SAHuang, LHuang, MYHuman, JLee, JHLi, XMartin, MWWhite, RDFremeau, RTPatel, VF Discovery of alpha-amidosulfones as potent and selective agonists of CB2: synthesis, SAR, and pharmacokinetic properties. Bioorg Med Chem Lett19:31-5 (2008) 
 
Cannabinoid receptor 2
Name:Cannabinoid receptor 2
Type:G Protein-Coupled Receptor (GPCR)
Mol. Mass.:39690.94
Organism:Homo sapiens (Human)
Description:P34972
Residue:360
BDBM50254143
NameBDBM50254143
Synonyms:CHEMBL511404 | N-(4-chloro-3-(furan-2-yl)phenyl)-2-(4-chlorophenylsulfonyl)-2-methylpropanamide
TypeSmall organic molecule
Emp. Form.C20H17Cl2NO4S
Mol. Mass.438.324
SMILESCC(C)(C(=O)Nc1ccc(Cl)c(c1)-c1ccco1)S(=O)(=O)c1ccc(Cl)cc1