Reaction Details
TargetCannabinoid receptor 2
LigandBDBM50254068
Substrate/Competitorn/a
Meas. Tech.ChEMBL_560040 (CHEMBL1021560)
EC50 73±n/a nM
Citation Marx, IEDiMauro, EFCheng, AEmkey, RHitchcock, SAHuang, LHuang, MYHuman, JLee, JHLi, XMartin, MWWhite, RDFremeau, RTPatel, VF Discovery of alpha-amidosulfones as potent and selective agonists of CB2: synthesis, SAR, and pharmacokinetic properties. Bioorg Med Chem Lett19:31-5 (2008) 
 
Cannabinoid receptor 2
Name:Cannabinoid receptor 2
Type:G Protein-Coupled Receptor (GPCR)
Mol. Mass.:39690.94
Organism:Homo sapiens (Human)
Description:P34972
Residue:360
BDBM50254068
NameBDBM50254068
Synonyms:2-(2-chloro-4-(trifluoromethyl)phenylsulfonyl)-2-methyl-N-(quinolin-3-yl)propanamide | CHEMBL466185
TypeSmall organic molecule
Emp. Form.C20H16ClF3N2O3S
Mol. Mass.456.866
SMILESCC(C)(C(=O)Nc1cnc2ccccc2c1)S(=O)(=O)c1ccc(cc1Cl)C(F)(F)F