Reaction Details
TargetCannabinoid receptor 1
LigandBDBM50254103
Substrate/Competitorn/a
Meas. Tech.ChEMBL_560042 (CHEMBL1022429)
EC50>1000±n/a nM
Citation Marx, IEDiMauro, EFCheng, AEmkey, RHitchcock, SAHuang, LHuang, MYHuman, JLee, JHLi, XMartin, MWWhite, RDFremeau, RTPatel, VF Discovery of alpha-amidosulfones as potent and selective agonists of CB2: synthesis, SAR, and pharmacokinetic properties. Bioorg Med Chem Lett19:31-5 (2008) 
 
Cannabinoid receptor 1
Name:Cannabinoid receptor 1
Type:G Protein-Coupled Receptor (GPCR)
Mol. Mass.:52868.96
Organism:Homo sapiens (Human)
Description:P21554
Residue:472
BDBM50254103
NameBDBM50254103
Synonyms:2-(4-chlorophenylsulfonyl)-2-methyl-N-(4-(trifluoromethyl)phenyl)propanamide | CHEMBL466402
TypeSmall organic molecule
Emp. Form.C17H15ClF3NO3S
Mol. Mass.405.819
SMILESCC(C)(C(=O)Nc1ccc(cc1)C(F)(F)F)S(=O)(=O)c1ccc(Cl)cc1