Reaction Details
TargetCannabinoid receptor 1
LigandBDBM50254101
Substrate/Competitorn/a
Meas. Tech.ChEMBL_560042 (CHEMBL1022429)
EC50>1000±n/a nM
Citation Marx, IEDiMauro, EFCheng, AEmkey, RHitchcock, SAHuang, LHuang, MYHuman, JLee, JHLi, XMartin, MWWhite, RDFremeau, RTPatel, VF Discovery of alpha-amidosulfones as potent and selective agonists of CB2: synthesis, SAR, and pharmacokinetic properties. Bioorg Med Chem Lett19:31-5 (2008) 
 
Cannabinoid receptor 1
Name:Cannabinoid receptor 1
Type:G Protein-Coupled Receptor (GPCR)
Mol. Mass.:52868.96
Organism:Homo sapiens (Human)
Description:P21554
Residue:472
BDBM50254101
NameBDBM50254101
Synonyms:2-(4-chlorophenylsulfonyl)-2-methyl-N-(quinolin-3-yl)propanamide | CHEMBL511233
TypeSmall organic molecule
Emp. Form.C19H17ClN2O3S
Mol. Mass.388.868
SMILESCC(C)(C(=O)Nc1cnc2ccccc2c1)S(=O)(=O)c1ccc(Cl)cc1