Reaction Details
TargetCannabinoid receptor 1
LigandBDBM50254126
Substrate/Competitorn/a
Meas. Tech.ChEMBL_560038 (CHEMBL1021558)
EC50>10000±n/a nM
Citation Marx, IEDiMauro, EFCheng, AEmkey, RHitchcock, SAHuang, LHuang, MYHuman, JLee, JHLi, XMartin, MWWhite, RDFremeau, RTPatel, VF Discovery of alpha-amidosulfones as potent and selective agonists of CB2: synthesis, SAR, and pharmacokinetic properties. Bioorg Med Chem Lett19:31-5 (2008) 
 
Cannabinoid receptor 1
Name:Cannabinoid receptor 1
Type:G Protein-Coupled Receptor (GPCR)
Mol. Mass.:52868.96
Organism:Homo sapiens (Human)
Description:P21554
Residue:472
BDBM50254126
NameBDBM50254126
Synonyms:CHEMBL468275 | N-(4-chloro-2-(trifluoromethoxy)phenyl)-2-(4-chlorophenylsulfonyl)-2-methylpropanamide
TypeSmall organic molecule
Emp. Form.C17H14Cl2F3NO4S
Mol. Mass.456.264
SMILESCC(C)(C(=O)Nc1ccc(Cl)cc1OC(F)(F)F)S(=O)(=O)c1ccc(Cl)cc1