Reaction Details
TargetAngiopoietin-1 receptor
LigandBDBM50266092
Substrate/Competitorn/a
Meas. Tech.ChEMBL_540209 (CHEMBL1029838)
IC50 470±n/a nM
Citation Cee, VJCheng, ACRomero, KBellon, SMohr, CWhittington, DABak, ABready, JCaenepeel, SCoxon, ADeak, HLFretland, JGu, YHodous, BLHuang, XKim, JLLin, JLong, AMNguyen, HOlivieri, PRPatel, VFWang, LZhou, YHughes, PGeuns-Meyer, S Pyridyl-pyrimidine benzimidazole derivatives as potent, selective, and orally bioavailable inhibitors of Tie-2 kinase. Bioorg Med Chem Lett19:424-7 (2008) 
 
Angiopoietin-1 receptor
Name:Angiopoietin-1 receptor
Type:Enzyme
Mol. Mass.:125835.70
Organism:Homo sapiens (Human)
Description:Q02763
Residue:1124
BDBM50266092
NameBDBM50266092
Synonyms:CHEMBL468618 | N-(3-methyl-4-(3-(2-(methylamino)pyrimidin-4-yl)pyridin-2-yloxy)phenyl)-6-(trifluoromethyl)-1H-benzo[d]imidazol-2-amine
TypeSmall organic molecule
Emp. Form.C25H20F3N7O
Mol. Mass.491.4678
SMILESCNc1nccc(n1)-c1cccnc1Oc1ccc(Nc2nc3ccc(cc3[nH]2)C(F)(F)F)cc1C