Reaction Details
TargetAngiopoietin-1 receptor
LigandBDBM50266186
Substrate/Competitorn/a
Meas. Tech.ChEMBL_540209 (CHEMBL1029838)
IC50 240±n/a nM
Citation Cee, VJCheng, ACRomero, KBellon, SMohr, CWhittington, DABak, ABready, JCaenepeel, SCoxon, ADeak, HLFretland, JGu, YHodous, BLHuang, XKim, JLLin, JLong, AMNguyen, HOlivieri, PRPatel, VFWang, LZhou, YHughes, PGeuns-Meyer, S Pyridyl-pyrimidine benzimidazole derivatives as potent, selective, and orally bioavailable inhibitors of Tie-2 kinase. Bioorg Med Chem Lett19:424-7 (2008) 
 
Angiopoietin-1 receptor
Name:Angiopoietin-1 receptor
Type:Enzyme
Mol. Mass.:125835.70
Organism:Homo sapiens (Human)
Description:Q02763
Residue:1124
BDBM50266186
NameBDBM50266186
Synonyms:1-methyl-N-(4-(3-(2-(methylamino)pyrimidin-4-yl)pyridin-2-yloxy)naphthalen-1-yl)-1H-benzo[d]imidazol-2-amine | CHEMBL457984
TypeSmall organic molecule
Emp. Form.C28H23N7O
Mol. Mass.473.5285
SMILESCNc1nccc(n1)-c1cccnc1Oc1ccc(Nc2nc3ccccc3n2C)c2ccccc12