Reaction Details
TargetAdenosine receptor A1
LigandBDBM50254012
Substrate/Competitorn/a
Meas. Tech.ChEMBL_560533 (CHEMBL1021383)
Ki 120±n/a nM
Citation Gillespie, RJBamford, SJBotting, RComer, MDenny, SGaur, SGriffin, MJordan, AMKnight, ARLerpiniere, JLeonardi, SLightowler, SMcAteer, SMerrett, AMisra, APadfield, AReece, MSaadi, MSelwood, DLStratton, GCSurry, DTodd, RTong, XRuston, VUpton, RWeiss, SM Antagonists of the human A(2A) adenosine receptor. 4. Design, synthesis, and preclinical evaluation of 7-aryltriazolo[4,5-d]pyrimidines. J Med Chem52:33-47 (2009) 
 
Adenosine receptor A1
Name:Adenosine receptor A1
Type:G Protein-Coupled Receptor (GPCR)
Mol. Mass.:36520.92
Organism:Homo sapiens (Human)
Description:P30542
Residue:326
BDBM50254012
NameBDBM50254012
Synonyms:3-(4-Amino-3-fluorobenzyl)-7-(2-furyl)-3H-[1,2,3]triazolo[4,5-d]pyrimidine-5-amine | CHEMBL517886
TypeSmall organic molecule
Emp. Form.C15H12FN7O
Mol. Mass.325.3005
SMILESNc1nc(-c2ccco2)c2nnn(Cc3ccc(N)c(F)c3)c2n1