Reaction Details
TargetAdenosine receptor A2a
LigandBDBM50253995
Substrate/Competitorn/a
Meas. Tech.ChEMBL_560532 (CHEMBL1021382)
Ki 2±n/a nM
Citation Gillespie, RJBamford, SJBotting, RComer, MDenny, SGaur, SGriffin, MJordan, AMKnight, ARLerpiniere, JLeonardi, SLightowler, SMcAteer, SMerrett, AMisra, APadfield, AReece, MSaadi, MSelwood, DLStratton, GCSurry, DTodd, RTong, XRuston, VUpton, RWeiss, SM Antagonists of the human A(2A) adenosine receptor. 4. Design, synthesis, and preclinical evaluation of 7-aryltriazolo[4,5-d]pyrimidines. J Med Chem52:33-47 (2009) 
 
Adenosine receptor A2a
Name:Adenosine receptor A2a
Type:G Protein-Coupled Receptor (GPCR)
Mol. Mass.:44716.46
Organism:Homo sapiens (Human)
Description:P29274
Residue:412
BDBM50253995
NameBDBM50253995
Synonyms:3-(2-Aminobenzyl)-7-(2-furyl)-3H-[1,2,3]triazolo[4,5-d]pyrimidine-5-amine | CHEMBL516483
TypeSmall organic molecule
Emp. Form.C15H13N7O
Mol. Mass.307.31
SMILESNc1nc(-c2ccco2)c2nnn(Cc3ccccc3N)c2n1